{"text_format":"3","workbook":"xlsx","n_sheets":2,"sheets":["Sheet1","第一页"],"not_rendered":{"defined_names":4},"read":"whole","date_system":"1900"}

{"sheet":"Sheet1","index":0,"n_rows":261,"n_cols":4,"rows_kept":261,"merged":[[0,0,0,2],[1,0,1,3]]}
["附件3"]
["2021年提升规模和新建投产工业企业名单"]
["序号","组织机构代码","企业名称","属地）"]
[1,{"$f":"VLOOKUP(C4,第一页!A:B,2,FALSE)","v":"MA32JJ4M5"},"福建浩氧环保有限公司","鼓楼区"]
[2,{"$f":"VLOOKUP(C5,第一页!A:B,2,FALSE)","v":"705102146"},"福建华电电力工程有限公司","鼓楼区"]
[3,{"$f":"VLOOKUP(C6,第一页!A:B,2,FALSE)","v":"569295739"},"福建金木年华家具有限公司","鼓楼区"]
[4,{"$f":"VLOOKUP(C7,第一页!A:B,2,FALSE)","v":"MA8RH4G95"},"福州莱科光电子制造有限公司","鼓楼区"]
[5,{"$f":"VLOOKUP(C8,第一页!A:B,2,FALSE)","v":"064104976"},"福州锐景达光电科技有限公司","鼓楼区"]
[6,{"$f":"VLOOKUP(C9,第一页!A:B,2,FALSE)","v":"660386105"},"福州赛瑞特新材料技术开发有限公司","鼓楼区"]
[7,{"$f":"VLOOKUP(C10,第一页!A:B,2,FALSE)","v":"MA33Q7RWX"},"福建憨球食品有限公司","仓山区"]
[8,{"$f":"VLOOKUP(C11,第一页!A:B,2,FALSE)","v":"MA3463R92"},"福建吉事达新能源科技有限公司","仓山区"]
[9,{"$f":"VLOOKUP(C12,第一页!A:B,2,FALSE)","v":"775384329"},"福建洁博利厨卫科技有限公司","仓山区"]
[10,{"$f":"VLOOKUP(C13,第一页!A:B,2,FALSE)","v":"MA3545PR2"},"福建美克莱铝业有限公司","仓山区"]
[11,{"$f":"VLOOKUP(C14,第一页!A:B,2,FALSE)","v":"060357036"},"福建天成保德环保科技有限公司","仓山区"]
[12,{"$f":"VLOOKUP(C15,第一页!A:B,2,FALSE)","v":"MA33DYB17"},"福建天成时代新能源科技有限公司","仓山区"]
[13,{"$f":"VLOOKUP(C16,第一页!A:B,2,FALSE)","v":"MA2YN5QP0"},"福建友鸿实业有限公司","仓山区"]
[14,{"$f":"VLOOKUP(C17,第一页!A:B,2,FALSE)","v":"MA33WXG1X"},"福建玉玲通线缆有限公司","仓山区"]
[15,{"$f":"VLOOKUP(C18,第一页!A:B,2,FALSE)","v":"569288694"},"福州百晶光电有限公司","仓山区"]
[16,{"$f":"VLOOKUP(C19,第一页!A:B,2,FALSE)","v":"759354760"},"福州博峰智能电器有限公司","仓山区"]
[17,{"$f":"VLOOKUP(C20,第一页!A:B,2,FALSE)","v":"MA32XF179"},"福州成宇电力设备有限公司","仓山区"]
[18,{"$f":"VLOOKUP(C21,第一页!A:B,2,FALSE)","v":"57928083X"},"福州登龙鞋业有限公司","仓山区"]
[19,{"$f":"VLOOKUP(C22,第一页!A:B,2,FALSE)","v":"574721165"},"福州福水源水务设备有限公司","仓山区"]
[20,{"$f":"VLOOKUP(C23,第一页!A:B,2,FALSE)","v":"569257249"},"福州高特光电科技有限公司","仓山区"]
[21,{"$f":"VLOOKUP(C24,第一页!A:B,2,FALSE)","v":"MA3481CRX"},"福州弘耀光电技术有限公司","仓山区"]
[22,{"$f":"VLOOKUP(C25,第一页!A:B,2,FALSE)","v":"MA2YA33Q6"},"福州嘉山金属制品有限公司","仓山区"]
[23,{"$f":"VLOOKUP(C26,第一页!A:B,2,FALSE)","v":"MA32TE2F6"},"福州金威航信息科技有限公司","仓山区"]
[24,{"$f":"VLOOKUP(C27,第一页!A:B,2,FALSE)","v":"779610821"},"福州康派克光电科技有限公司","仓山区"]
[25,{"$f":"VLOOKUP(C28,第一页!A:B,2,FALSE)","v":"678480423"},"福州菱成电装有限公司","仓山区"]
[26,{"$f":"VLOOKUP(C29,第一页!A:B,2,FALSE)","v":"MA34FX6B6"},"福州仁合创鑫实业有限公司","仓山区"]
[27,{"$f":"VLOOKUP(C30,第一页!A:B,2,FALSE)","v":"MA1NW5MX8"},"福州锐迪优通讯科技有限公司","仓山区"]
[28,{"$f":"VLOOKUP(C31,第一页!A:B,2,FALSE)","v":"77962545X"},"福州锐洁源电子科技有限公司","仓山区"]
[29,{"$f":"VLOOKUP(C32,第一页!A:B,2,FALSE)","v":"MA2XN8YE9"},"福州威泰思光电科技有限公司","仓山区"]
[30,{"$f":"VLOOKUP(C33,第一页!A:B,2,FALSE)","v":"MA2YPM999"},"福州薇麦初秋食品有限公司","仓山区"]
[31,{"$f":"VLOOKUP(C34,第一页!A:B,2,FALSE)","v":"310790722"},"福州亿维格电子有限公司","仓山区"]
[32,{"$f":"VLOOKUP(C35,第一页!A:B,2,FALSE)","v":"572971259"},"福州智元仪器设备有限公司","仓山区"]
[33,{"$f":"VLOOKUP(C36,第一页!A:B,2,FALSE)","v":"MA32P7U19"},"恩耐斯（福建）科技有限公司","晋安区"]
[34,{"$f":"VLOOKUP(C37,第一页!A:B,2,FALSE)","v":"MA2Y4D084"},"福建海峡环保资源开发有限公司","晋安区"]
[35,{"$f":"VLOOKUP(C38,第一页!A:B,2,FALSE)","v":"MA34618N0"},"福建巨泉集团有限公司","晋安区"]
[36,{"$f":"VLOOKUP(C39,第一页!A:B,2,FALSE)","v":"553248970"},"福建联畅科技有限公司","晋安区"]
[37,{"$f":"VLOOKUP(C40,第一页!A:B,2,FALSE)","v":"MA2Y0YA24"},"福建闽仪自动化设备有限公司","晋安区"]
[38,{"$f":"VLOOKUP(C41,第一页!A:B,2,FALSE)","v":"MA2YEBDJ6"},"福建先德能源科技有限公司","晋安区"]
[39,{"$f":"VLOOKUP(C42,第一页!A:B,2,FALSE)","v":"MA33EA9KX"},"福建新华联合印务集团有限公司","晋安区"]
[40,{"$f":"VLOOKUP(C43,第一页!A:B,2,FALSE)","v":"754983875"},"福州辰达五金机械有限公司","晋安区"]
[41,{"$f":"VLOOKUP(C44,第一页!A:B,2,FALSE)","v":"678485945"},"福建福菱建材科技有限公司","晋安区"]
[42,{"$f":"VLOOKUP(C45,第一页!A:B,2,FALSE)","v":"MA3320JB7"},"福州麦典服装有限公司","晋安区"]
[43,{"$f":"VLOOKUP(C46,第一页!A:B,2,FALSE)","v":"784528400"},"福州鑫霖电子有限公司","晋安区"]
[44,{"$f":"VLOOKUP(C47,第一页!A:B,2,FALSE)","v":"775387458"},"福州玉龙建材有限公司","晋安区"]
[45,{"$f":"VLOOKUP(C48,第一页!A:B,2,FALSE)","v":"MA34PB619"},"福州源长胜服饰有限公司","晋安区"]
[46,{"$f":"VLOOKUP(C49,第一页!A:B,2,FALSE)","v":"583109197"},"福州中核三重阀门制造有限公司","晋安区"]
[47,{"$f":"VLOOKUP(C50,第一页!A:B,2,FALSE)","v":"070851492"},"福建胜诚发水产有限公司","马尾区"]
[48,{"$f":"VLOOKUP(C51,第一页!A:B,2,FALSE)","v":"315548847"},"福建鑫美臣食品有限公司","马尾区"]
[49,{"$f":"VLOOKUP(C52,第一页!A:B,2,FALSE)","v":"MA2YJ4YL4"},"福建中量智汇科技有限公司","马尾区"]
[50,{"$f":"VLOOKUP(C53,第一页!A:B,2,FALSE)","v":"077436478"},"福州冠泓新材料科技有限公司","马尾区"]
[51,{"$f":"VLOOKUP(C54,第一页!A:B,2,FALSE)","v":"310678538"},"福州宏鑫华鞋业有限公司","马尾区"]
[52,{"$f":"VLOOKUP(C55,第一页!A:B,2,FALSE)","v":"310623123"},"福州华晨纸品包装有限公司","马尾区"]
[53,{"$f":"VLOOKUP(C56,第一页!A:B,2,FALSE)","v":"735654814"},"福州开发区联盛运动器材有限公司","马尾区"]
[54,{"$f":"VLOOKUP(C57,第一页!A:B,2,FALSE)","v":"768587929"},"福州盛博电子有限公司","马尾区"]
[55,{"$f":"VLOOKUP(C58,第一页!A:B,2,FALSE)","v":"MA3515F95"},"福州市名睿体育用品有限公司","马尾区"]
[56,{"$f":"VLOOKUP(C59,第一页!A:B,2,FALSE)","v":"315305511"},"福州兴峰机械设备有限公司","马尾区"]
[57,{"$f":"VLOOKUP(C60,第一页!A:B,2,FALSE)","v":"MA33G7C08"},"福州一凡科技有限公司","马尾区"]
[58,{"$f":"VLOOKUP(C61,第一页!A:B,2,FALSE)","v":"MA33QHKK4"},"福建达华智显科技有限公司","长乐区"]
[59,{"$f":"VLOOKUP(C62,第一页!A:B,2,FALSE)","v":"MA33Q231X"},"福建华兴永盛实业有限公司","长乐区"]
[60,{"$f":"VLOOKUP(C63,第一页!A:B,2,FALSE)","v":"058417650"},"福建嘉禾源水产品有限责任公司","长乐区"]
[61,{"$f":"VLOOKUP(C64,第一页!A:B,2,FALSE)","v":"064128521"},"福建捷高纺织有限公司","长乐区"]
[62,{"$f":"VLOOKUP(C65,第一页!A:B,2,FALSE)","v":"MA2Y8RD44"},"福建捷纶纺织有限公司","长乐区"]
[63,{"$f":"VLOOKUP(C66,第一页!A:B,2,FALSE)","v":"MA8RHT2N9"},"福建聚创纺织有限公司","长乐区"]
[64,{"$f":"VLOOKUP(C67,第一页!A:B,2,FALSE)","v":"MA331T4W7"},"福建开物冶金设备有限公司","长乐区"]
[65,{"$f":"VLOOKUP(C68,第一页!A:B,2,FALSE)","v":"MA31LTXQX"},"福建康辉纺织科技有限公司","长乐区"]
[66,{"$f":"VLOOKUP(C69,第一页!A:B,2,FALSE)","v":"MA34L8UP8"},"福建楠源家居有限公司","长乐区"]
[67,{"$f":"VLOOKUP(C70,第一页!A:B,2,FALSE)","v":"MA33JBDG2"},"福建润升针织有限公司","长乐区"]
[68,{"$f":"VLOOKUP(C71,第一页!A:B,2,FALSE)","v":"MA32937B6"},"福建省盛凯恒业发展有限公司","长乐区"]
[69,{"$f":"VLOOKUP(C72,第一页!A:B,2,FALSE)","v":"MA33UEXA9"},"福建省信骉金属制品有限公司","长乐区"]
[70,{"$f":"VLOOKUP(C73,第一页!A:B,2,FALSE)","v":"MA32YD910"},"福建伊纺达工纺新材料科技有限公司","长乐区"]
[71,{"$f":"VLOOKUP(C74,第一页!A:B,2,FALSE)","v":"MA34H2Q69"},"福建元旺食品有限公司","长乐区"]
[72,{"$f":"VLOOKUP(C75,第一页!A:B,2,FALSE)","v":"077400491"},"福建源盛达科技有限公司","长乐区"]
[73,{"$f":"VLOOKUP(C76,第一页!A:B,2,FALSE)","v":"MA2XU6NX7"},"福州丰雨针织有限公司","长乐区"]
[74,{"$f":"VLOOKUP(C77,第一页!A:B,2,FALSE)","v":"MA3365976"},"福州精艺恒盛新材料科技有限公司","长乐区"]
[75,{"$f":"VLOOKUP(C78,第一页!A:B,2,FALSE)","v":"MA2YABY7X"},"福州玛克伯爵装饰材料有限公司","长乐区"]
[76,{"$f":"VLOOKUP(C79,第一页!A:B,2,FALSE)","v":"MA33H00X8"},"福州美通塑料制品有限公司","长乐区"]
[77,{"$f":"VLOOKUP(C80,第一页!A:B,2,FALSE)","v":"577022108"},"福州明升针纺织品有限公司","长乐区"]
[78,{"$f":"VLOOKUP(C81,第一页!A:B,2,FALSE)","v":"779630910"},"福州森辰鑫木业有限公司","长乐区"]
[79,{"$f":"VLOOKUP(C82,第一页!A:B,2,FALSE)","v":"766158688"},"福州森瑞家居用品有限公司","长乐区"]
[80,{"$f":"VLOOKUP(C83,第一页!A:B,2,FALSE)","v":"759351260"},"福州盛伟机械制造有限公司","长乐区"]
[81,{"$f":"VLOOKUP(C84,第一页!A:B,2,FALSE)","v":"589564166"},"福州市杰成针纺有限公司","长乐区"]
[82,{"$f":"VLOOKUP(C85,第一页!A:B,2,FALSE)","v":"MA33HPDJ4"},"福州市源顺发针纺有限公司","长乐区"]
[83,{"$f":"VLOOKUP(C86,第一页!A:B,2,FALSE)","v":"577027136"},"福州市长乐区盛邦纸制品有限公司","长乐区"]
[84,{"$f":"VLOOKUP(C87,第一页!A:B,2,FALSE)","v":"569272852"},"福州市长乐区裕锦针织有限公司","长乐区"]
[85,{"$f":"VLOOKUP(C88,第一页!A:B,2,FALSE)","v":"MA32TCD32"},"福州天利和纺织有限公司","长乐区"]
[86,{"$f":"VLOOKUP(C89,第一页!A:B,2,FALSE)","v":"MA2YKMEXX"},"福州竹智家居用品有限公司","长乐区"]
[87,{"$f":"VLOOKUP(C90,第一页!A:B,2,FALSE)","v":"MA3486UR8"},"福州市长乐区佳源纸业有限公司","长乐区"]
[88,{"$f":"VLOOKUP(C91,第一页!A:B,2,FALSE)","v":"050302883"},"福州天顺针织有限公司","长乐区"]
[89,{"$f":"VLOOKUP(C92,第一页!A:B,2,FALSE)","v":"315608010"},"福州翔杰纺织有限公司","长乐区"]
[90,{"$f":"VLOOKUP(C93,第一页!A:B,2,FALSE)","v":"MA31TDNX3"},"中节能（福州）环保能源有限公司","长乐区"]
[91,{"$f":"VLOOKUP(C94,第一页!A:B,2,FALSE)","v":"MA8T1AWX4"},"奥斯玛特智能装备（福建）有限公司","福清市"]
[92,{"$f":"VLOOKUP(C95,第一页!A:B,2,FALSE)","v":"665064201"},"百利（福建）建材有限公司","福清市"]
[93,{"$f":"VLOOKUP(C96,第一页!A:B,2,FALSE)","v":"754994267"},"福建宝利特新材料科技有限公司","福清市"]
[94,{"$f":"VLOOKUP(C97,第一页!A:B,2,FALSE)","v":"MA33J7R34"},"福建朝华食品有限公司","福清市"]
[95,{"$f":"VLOOKUP(C98,第一页!A:B,2,FALSE)","v":"MA2YEQ703"},"福建成和光电科技有限公司","福清市"]
[96,{"$f":"VLOOKUP(C99,第一页!A:B,2,FALSE)","v":"MA2YHA6T7"},"福建东方小飞光电科技有限公司","福清市"]
[97,{"$f":"VLOOKUP(C100,第一页!A:B,2,FALSE)","v":"MA33MNNF7"},"福建福藤新型环保建材有限公司","福清市"]
[98,{"$f":"VLOOKUP(C101,第一页!A:B,2,FALSE)","v":"091355121"},"福建晶丰玻璃有限公司","福清市"]
[99,{"$f":"VLOOKUP(C102,第一页!A:B,2,FALSE)","v":"MA31K42KX"},"福建卡乐丽新型建材科技有限公司","福清市"]
[100,{"$f":"VLOOKUP(C103,第一页!A:B,2,FALSE)","v":"MA2YCP4C9"},"福建康鸿生物科技有限公司","福清市"]
[101,{"$f":"VLOOKUP(C104,第一页!A:B,2,FALSE)","v":"570991491"},"福建科亿电力有限公司","福清市"]
[102,{"$f":"VLOOKUP(C105,第一页!A:B,2,FALSE)","v":"MA31WLMC3"},"福建乐泽科技有限公司","福清市"]
[103,{"$f":"VLOOKUP(C106,第一页!A:B,2,FALSE)","v":"MA321Q6W0"},"福建力普达高温材料有限公司","福清市"]
[104,{"$f":"VLOOKUP(C107,第一页!A:B,2,FALSE)","v":"MA32FLXY1"},"福建美盈森环保科技有限公司","福清市"]
[105,{"$f":"VLOOKUP(C108,第一页!A:B,2,FALSE)","v":"MA33BLGA6"},"福建青祥鞋业有限公司","福清市"]
[106,{"$f":"VLOOKUP(C109,第一页!A:B,2,FALSE)","v":"MA2Y19L21"},"福建瑞虹贾卡实业有限公司","福清市"]
[107,{"$f":"VLOOKUP(C110,第一页!A:B,2,FALSE)","v":"MA2YQX505"},"福建润强包装材料有限公司","福清市"]
[108,{"$f":"VLOOKUP(C111,第一页!A:B,2,FALSE)","v":"MA34EFGA7"},"福建森得瑞家居用品有限公司","福清市"]
[109,{"$f":"VLOOKUP(C112,第一页!A:B,2,FALSE)","v":"070886230"},"福建省创翔鞋业有限公司","福清市"]
[110,{"$f":"VLOOKUP(C113,第一页!A:B,2,FALSE)","v":"154922825"},"福建省福清市优盛建材有限公司","福清市"]
[111,{"$f":"VLOOKUP(C114,第一页!A:B,2,FALSE)","v":"MA32CA9G5"},"福建省嘉鑫科技实业有限公司","福清市"]
[112,{"$f":"VLOOKUP(C115,第一页!A:B,2,FALSE)","v":"315501395"},"福建省鑫德福农产品有限公司","福清市"]
[113,{"$f":"VLOOKUP(C116,第一页!A:B,2,FALSE)","v":"MA2YECL04"},"福建小飞科技有限公司","福清市"]
[114,{"$f":"VLOOKUP(C117,第一页!A:B,2,FALSE)","v":"587510500"},"福建欣星原电子有限公司","福清市"]
[115,{"$f":"VLOOKUP(C118,第一页!A:B,2,FALSE)","v":"MA33XR8E4"},"福建新福兴玻璃智能科技有限公司","福清市"]
[116,{"$f":"VLOOKUP(C119,第一页!A:B,2,FALSE)","v":"MA33KGQB3"},"福建新展自动化科技有限公司","福清市"]
[117,{"$f":"VLOOKUP(C120,第一页!A:B,2,FALSE)","v":"MA32LTM59"},"福建鑫兴食品有限公司","福清市"]
{"$rows_left_out":142}
{"sheet":"第一页","index":1,"n_rows":2964,"n_cols":6,"rows_kept":2964}
["单位详细名称","组织机构代码","行业代码","行业小类","行业中类","县市区"]
["国网福建省电力有限公司",158142631,4420,"电力供应","电力、热力生产和供应业","鼓楼区"]
["宝钢德盛不锈钢有限公司","782167613",3130,"钢压延加工","黑色金属冶炼和压延加工业","罗源县"]
["福建申远新材料有限公司","062297284",2653,"合成纤维单聚合体制造","化学原料和化学制品制造业","连江县"]
["福建大东海实业集团有限公司","337588532",3120,"炼钢","黑色金属冶炼和压延加工业","长乐区"]
["福建永荣锦江股份有限公司","78691468X",2821,"锦纶纤维制造","化学纤维制造业","长乐区"]
["冠捷电子科技（福建）有限公司","738040607",3912,"计算机零部件制造","计算机、通信和其他电子设备制造业","福清市"]
["福建福清核电有限公司","786948070",4414,"核力发电","电力、热力生产和供应业","福清市"]
["福建罗源闽光钢铁有限责任公司","310715837",3130,"钢压延加工","黑色金属冶炼和压延加工业","罗源县"]
["福建奔驰汽车有限公司","717867832",3611,"汽柴油车整车制造","汽车制造业","闽侯县"]
["福建省力恒锦纶实业有限公司","779625951",2821,"锦纶纤维制造","化学纤维制造业","长乐区"]
["锐捷网络股份有限公司","754961764",3919,"其他计算机制造","计算机、通信和其他电子设备制造业","仓山区"]
["福州京东方光电科技有限公司","337620168",3974,"显示器件制造","计算机、通信和其他电子设备制造业","福清市"]
["福建景丰科技有限公司","572975137",2821,"锦纶纤维制造","化学纤维制造业","长乐区"]
["福建长源纺织有限公司","784518982",1711,"棉纺纱加工","纺织业","长乐区"]
["福建中景石化有限公司","559555779",2651,"初级形态塑料及合成树脂制造","化学原料和化学制品制造业","福清市"]
["中铝瑞闽股份有限公司","611000624",3252,"铝压延加工","有色金属冶炼和压延加工业","马尾区"]
["福州市长乐锦源纺织有限公司","550983507",1711,"棉纺纱加工","纺织业","长乐区"]
["福建申马新材料有限公司","MA31GW0N6",2619,"其他基础化学原料制造","化学原料和化学制品制造业","连江县"]
["福建亿鑫钢铁有限公司","746371334",3120,"炼钢","黑色金属冶炼和压延加工业","罗源县"]
["万华化学（福建）异氰酸酯有限公司","MA2YRCD12",2614,"有机化学原料制造","化学原料和化学制品制造业","福清市"]
["万华化学（福建）有限公司","MA33QYY14",2614,"有机化学原料制造","化学原料和化学制品制造业","福清市"]
["飞毛腿(福建)电子有限公司","611338123",3841,"锂离子电池制造","电气机械和器材制造业","马尾区"]
["福建祥鑫股份有限公司","741685238",3252,"铝压延加工","有色金属冶炼和压延加工业","闽侯县"]
["福建省金纶高纤股份有限公司","754974821",2822,"涤纶纤维制造","化学纤维制造业","长乐区"]
["福州中民新能源有限公司","567346256",4512,"液化石油气生产和供应业","燃气生产和供应业","福清市"]
["福建凯邦锦纶科技有限公司","796093934",2821,"锦纶纤维制造","化学纤维制造业","长乐区"]
["捷星显示科技(福建)有限公司","696641438",3912,"计算机零部件制造","计算机、通信和其他电子设备制造业","福清市"]
["福建华电可门发电有限公司","75314528X",4411,"火力发电","电力、热力生产和供应业","连江县"]
["新大陆数字技术股份有限公司","154586155",3475,"计算器及货币专用设备制造","通用设备制造业","马尾区"]
["福建新华源纺织集团有限公司","553235635",1711,"棉纺纱加工","纺织业","长乐区"]
["福建美得石化有限公司","567342722",2614,"有机化学原料制造","化学原料和化学制品制造业","福清市"]
["福建省中江石化有限公司","561668609",2651,"初级形态塑料及合成树脂制造","化学原料和化学制品制造业","福清市"]
["福建康泰再生资源利用有限公司","MA32AQ2K6",4210,"金属废料和碎屑加工处理","废弃资源综合利用业","长乐区"]
["福建元成豆业有限公司","759388506",1329,"其他饲料加工","农副食品加工业","长乐区"]
["福建省马尾造船股份有限公司","158147344",3731,"金属船舶制造","铁路、船舶、航空航天和其他运输设备制造业","连江县"]
["国能（连江）港电有限公司","593475975",4411,"火力发电","电力、热力生产和供应业","连江县"]
["福建省长乐市山力化纤有限公司","705394353",2822,"涤纶纤维制造","化学纤维制造业","长乐区"]
["福建吴航不锈钢制品有限公司","611315554",3130,"钢压延加工","黑色金属冶炼和压延加工业","长乐区"]
["福州吴航钢铁制品有限公司","75135124X",3130,"钢压延加工","黑色金属冶炼和压延加工业","长乐区"]
["福建省恒申合纤科技有限公司","557557092",2821,"锦纶纤维制造","化学纤维制造业","长乐区"]
["华能国际电力股份有限公司福州电厂","X11041238",4411,"火力发电","电力、热力生产和供应业","长乐区"]
["中国石油天然气股份有限公司天然气销售福建分公司","MA2XX1JM4",4511,"天然气生产和供应业","燃气生产和供应业","仓山区"]
["昇兴集团股份有限公司","611005951",3333,"金属包装容器及材料制造","金属制品业","马尾区"]
["福建天辰耀隆新材料有限公司","589572449",2614,"有机化学原料制造","化学原料和化学制品制造业","福清市"]
["福建华源纺织有限公司","738039956",1711,"棉纺纱加工","纺织业","长乐区"]
["东南（福建）汽车工业股份有限公司","611007201",3611,"汽柴油车整车制造","汽车制造业","闽侯县"]
["福建罗源小蕉轧钢有限公司","MA31RACX4",3130,"钢压延加工","黑色金属冶炼和压延加工业","罗源县"]
["福州市长乐区华亚纺织有限公司","705394310",1711,"棉纺纱加工","纺织业","长乐区"]
["福建友谊胶粘带集团有限公司","611839374",2411,"文具制造","文教、工美、体育和娱乐用品制造业","福清市"]
["福建经纬新纤科技实业有限公司","561676676",2822,"涤纶纤维制造","化学纤维制造业","福清市"]
["福建长德蛋白科技有限公司","08164283X",1329,"其他饲料加工","农副食品加工业","福清市"]
["福建凯航再生资源有限责任公司","MA2Y6TQF1",4210,"金属废料和碎屑加工处理","废弃资源综合利用业","长乐区"]
["国能（福州）热电有限公司","759386148",4412,"热电联产","电力、热力生产和供应业","福清市"]
["福建合盛气体有限公司","075035777",2619,"其他基础化学原料制造","化学原料和化学制品制造业","连江县"]
["福建元恒再生资源有限责任公司","MA31FHYR9",4210,"金属废料和碎屑加工处理","废弃资源综合利用业","长乐区"]
["福建金德尚黄金有限公司","739518051",2438,"珠宝首饰及有关物品制造","文教、工美、体育和娱乐用品制造业","长乐区"]
["福建省万达汽车玻璃工业有限公司","61132408X",3042,"特种玻璃制造","非金属矿物制品业","福清市"]
["福建省长乐市第二棉纺织厂","154874851",1711,"棉纺纱加工","纺织业","长乐区"]
["福建御冠食品有限公司","MA32TJ493",1353,"肉制品及副产品加工","农副食品加工业","福清市"]
["福建正隆纺织有限公司","741687268",1711,"棉纺纱加工","纺织业","长乐区"]
["长乐聚泉食品有限公司","611340426",1362,"鱼糜制品及水产品干腌制加工","农副食品加工业","长乐区"]
["福建东水食品股份有限公司","761759134",1361,"水产品冷冻加工","农副食品加工业","长乐区"]
["福建新创锦纶实业有限公司","MA2YYGWL6",2821,"锦纶纤维制造","化学纤维制造业","长乐区"]
["华能罗源发电有限责任公司","098328345",4411,"火力发电","电力、热力生产和供应业","罗源县"]
["利莱森玛电机科技(福州)有限公司","611332776",3811,"发电机及发电机组制造","电气机械和器材制造业","仓山区"]
["大通（福建）新材料股份有限公司","775367844",3831,"电线电缆制造","电气机械和器材制造业","马尾区"]
["福建金鑫纺织有限公司","154878916",1711,"棉纺纱加工","纺织业","长乐区"]
["福建省恒诚新材料科技有限公司","MA8TG9JF3",2821,"锦纶纤维制造","化学纤维制造业","连江县"]
["福州鑫广泰工贸有限公司","MA3393E87",4210,"金属废料和碎屑加工处理","废弃资源综合利用业","闽侯县"]
["奋安铝业股份有限公司","260170698",3252,"铝压延加工","有色金属冶炼和压延加工业","福清市"]
["福建德胜能源有限公司","66038322X",2521,"炼焦","石油加工、炼焦和核燃料加工业","罗源县"]
["福州华润燃气有限公司","154396888",4511,"天然气生产和供应业","燃气生产和供应业","晋安区"]
["福建经纬集团有限公司","154897885",1711,"棉纺纱加工","纺织业","长乐区"]
["福建永盛金属制品有限公司","628502604",3130,"钢压延加工","黑色金属冶炼和压延加工业","长乐区"]
["福建金风科技有限公司","MA2YKDFD8",3811,"发电机及发电机组制造","电气机械和器材制造业","福清市"]
["福建新大陆支付技术有限公司","597887897",3475,"计算器及货币专用设备制造","通用设备制造业","马尾区"]
["福建博那德科技园开发有限公司","073220127",3311,"金属结构制造","金属制品业","长乐区"]
["福建天马科技集团股份有限公司","782174522",1329,"其他饲料加工","农副食品加工业","福清市"]
["福州集佳油脂有限公司","555084615",1331,"食用植物油加工","农副食品加工业","福清市"]
["福建东南造船有限公司","158145306",3731,"金属船舶制造","铁路、船舶、航空航天和其他运输设备制造业","马尾区"]
["福建省东南电化股份有限公司","705101063",2614,"有机化学原料制造","化学原料和化学制品制造业","福清市"]
["福州高意光学有限公司","738039171",3976,"光电子器件制造","计算机、通信和其他电子设备制造业","晋安区"]
["福建康宏股份有限公司","727899563",1331,"食用植物油加工","农副食品加工业","福清市"]
["福建省福抗药业股份有限公司","739544081",2710,"化学药品原料药制造","医药制造业","福清市"]
["瑞芯微电子股份有限公司","733599532",3973,"集成电路制造","计算机、通信和其他电子设备制造业","鼓楼区"]
["福建星网锐捷通讯股份有限公司","611008511",3911,"计算机整机制造","计算机、通信和其他电子设备制造业","仓山区"]
["福建榕升纸业有限公司","MA328N9P2",2221,"机制纸及纸板制造","造纸和纸制品业","福清市"]
["裕丰源（福建）实业发展有限公司","557561681",1761,"针织或钩针编织物织造","纺织业","长乐区"]
["福州市力源锦纶实业有限公司","746388443",2821,"锦纶纤维制造","化学纤维制造业","长乐区"]
["正太新材料科技有限责任公司","MA32EX2J9",2643,"工业颜料制造","化学原料和化学制品制造业","福清市"]
["中铝瑞闽（福建）新材料有限公司","MA33GWQY3",3252,"铝压延加工","有色金属冶炼和压延加工业","福清市"]
["福建力盛纺织有限公司","759368898",1763,"针织或钩针编织品制造","纺织业","长乐区"]
["福耀玻璃工业集团股份有限公司","611300758",3041,"平板玻璃制造","非金属矿物制品业","福清市"]
["福州市星辉针织有限公司","717351166",1763,"针织或钩针编织品制造","纺织业","长乐区"]
["福建环洋新材料有限公司","MA2XRQ5P5",2661,"化学试剂和助剂制造","化学原料和化学制品制造业","福清市"]
["福建祥鑫新材料科技有限公司","MA3380M09",3240,"有色金属合金制造","有色金属冶炼和压延加工业","闽侯县"]
["福州市长乐区闽发食品水产有限公司","611330463",1361,"水产品冷冻加工","农副食品加工业","长乐区"]
["东方电气风电（福建）有限公司","MA32YNEYX",3811,"发电机及发电机组制造","电气机械和器材制造业","福清市"]
["福州统一企业有限公司","729696401",1433,"方便面制造","食品制造业","马尾区"]
["中建商品混凝土（福建）有限公司","070866723",3021,"水泥制品制造","非金属矿物制品业","马尾区"]
["福建水口发电集团有限公司","724218232",4413,"水力发电","电力、热力生产和供应业","闽清县"]
["福建星云电子股份有限公司","770663716",4011,"工业自动控制系统装置制造","仪器仪表制造业","马尾区"]
["福州市长乐区东港纺织有限公司","78694028X",1763,"针织或钩针编织品制造","纺织业","长乐区"]
["福州高意通讯有限公司","611700460",3976,"光电子器件制造","计算机、通信和其他电子设备制造业","晋安区"]
["福建省长乐市天梭纺织实业有限公司","727917653",1711,"棉纺纱加工","纺织业","长乐区"]
["飞毛腿电池有限公司","782178582",3849,"其他电池制造","电气机械和器材制造业","马尾区"]
["福建恒捷实业有限公司","058442274",2821,"锦纶纤维制造","化学纤维制造业","连江县"]
["福建正鑫纺织有限公司","775397912",1711,"棉纺纱加工","纺织业","长乐区"]
["福建永强力加动力设备有限公司","793784801",3811,"发电机及发电机组制造","电气机械和器材制造业","福清市"]
["福建飞毛腿动力科技有限公司","MA346CL64",3841,"锂离子电池制造","电气机械和器材制造业","马尾区"]
["福州新福兴玻璃科技有限公司","05841023X",3042,"特种玻璃制造","非金属矿物制品业","福清市"]
["丽珠集团福州福兴医药有限公司","611303027",2710,"化学药品原料药制造","医药制造业","福清市"]
["金强（福建）建材科技股份有限公司","563390997",3024,"轻质建筑材料制造","非金属矿物制品业","长乐区"]
["福融新材料股份有限公司","591732122",2921,"塑料薄膜制造","橡胶和塑料制品业","福清市"]
["福建精联科技有限公司","MA2XYFF96",2822,"涤纶纤维制造","化学纤维制造业","长乐区"]
["福州海马饲料有限公司","611440021",1329,"其他饲料加工","农副食品加工业","福清市"]
["福建省福能海峡发电有限公司","MA328GJE7",4415,"风力发电","电力、热力生产和供应业","长乐区"]
["福清华润燃气有限公司","729736725",4511,"天然气生产和供应业","燃气生产和供应业","福清市"]
["中邮科通信技术股份有限公司","158163475",3921,"通信系统设备制造","计算机、通信和其他电子设备制造业","仓山区"]
{"$rows_left_out":2844}