{"text_format":"3","workbook":"xlsx","n_sheets":2,"sheets":["小升规","年度+月度"],"not_rendered":{"defined_names":4,"pivot_tables":1},"read":"whole","date_system":"1900"}

{"sheet":"小升规","index":0,"n_rows":238,"n_cols":6,"rows_kept":238,"merged":[[1,0,1,4]]}
["附件1"]
["2023年提升规模和新建投产企业表"]
["序号","组织机构代码","企业名称","属地","类别"]
[1,{"$f":"VLOOKUP(C4,'年度+月度'!E:F,2,FALSE)","v":"MA33WCDD1"},"福建华电福瑞能源发展有限公司","鼓楼区","提升规模"]
[2,{"$f":"VLOOKUP(C5,'年度+月度'!E:F,2,FALSE)","v":"MA32TEK91"},"福建研宇自动化科技有限公司","鼓楼区","提升规模"]
[3,{"$f":"VLOOKUP(C6,'年度+月度'!E:F,2,FALSE)","v":"MA34FYP85"},"福州亿芯微科技有限公司","鼓楼区","提升规模"]
[4,{"$f":"VLOOKUP(C7,'年度+月度'!E:F,2,FALSE)","v":"MA34AJ8P8"},"福建国电风力发电有限公司","鼓楼区","提升规模"]
[5,{"$f":"VLOOKUP(C8,'年度+月度'!E:F,2,FALSE)","v":"MA31D40C3"},"福建耐固士实业有限公司","鼓楼区","提升规模"]
[6,{"$f":"VLOOKUP(C9,'年度+月度'!E:F,2,FALSE)","v":"798382246"},"福州荣旺工贸有限公司","鼓楼区","提升规模"]
[7,{"$f":"VLOOKUP(C10,'年度+月度'!E:F,2,FALSE)","v":"315344780"},"福建鼎旸信息科技股份有限公司","鼓楼区","提升规模"]
[8,{"$f":"VLOOKUP(C11,'年度+月度'!E:F,2,FALSE)","v":"MABT1QF13"},"福州市耐步鞋业有限公司","仓山区","提升规模"]
[9,{"$f":"VLOOKUP(C12,'年度+月度'!E:F,2,FALSE)","v":"671921820"},"福州汉晶电子科技有限公司","仓山区","提升规模"]
[10,{"$f":"VLOOKUP(C13,'年度+月度'!E:F,2,FALSE)","v":"310760443"},"福州比得福农业科技发展有限公司","仓山区","提升规模"]
[11,{"$f":"VLOOKUP(C14,'年度+月度'!E:F,2,FALSE)","v":"669260269"},"福州日恒机电设备有限公司","仓山区","提升规模"]
[12,{"$f":"VLOOKUP(C15,'年度+月度'!E:F,2,FALSE)","v":"727913775"},"福州东仕照明科技有限公司","仓山区","提升规模"]
[13,{"$f":"VLOOKUP(C16,'年度+月度'!E:F,2,FALSE)","v":"MA33EGFT8"},"福州锦雅服装有限公司","仓山区","提升规模"]
[14,{"$f":"VLOOKUP(C17,'年度+月度'!E:F,2,FALSE)","v":"550993916"},"福州金信光电有限公司","仓山区","提升规模"]
[15,{"$f":"VLOOKUP(C18,'年度+月度'!E:F,2,FALSE)","v":"MA32KKGL1"},"福州基石医药科技有限公司","仓山区","新建投产"]
[16,{"$f":"VLOOKUP(C19,'年度+月度'!E:F,2,FALSE)","v":"591726515"},"福州融源达服饰有限公司","晋安区","提升规模"]
[17,{"$f":"VLOOKUP(C20,'年度+月度'!E:F,2,FALSE)","v":"MA2XUF9N0"},"福建中燃电力销售有限公司","晋安区","提升规模"]
[18,{"$f":"VLOOKUP(C21,'年度+月度'!E:F,2,FALSE)","v":"MABWM5LJ9"},"福建省吉泽铜业有限公司","晋安区","提升规模"]
[19,{"$f":"VLOOKUP(C22,'年度+月度'!E:F,2,FALSE)","v":"M0001FWF3"},"福建省江南顺达线缆有限公司","晋安区","提升规模"]
[20,{"$f":"VLOOKUP(C23,'年度+月度'!E:F,2,FALSE)","v":"MA351TBX1"},"福建晶兰元工贸有限责任公司","晋安区","提升规模"]
[21,{"$f":"VLOOKUP(C24,'年度+月度'!E:F,2,FALSE)","v":"MA3557YY8"},"福建旭时新材料有限公司","晋安区","提升规模"]
[22,{"$f":"VLOOKUP(C25,'年度+月度'!E:F,2,FALSE)","v":"MA34PD817"},"福建华合祥润工贸有限公司","晋安区","提升规模"]
[23,{"$f":"VLOOKUP(C26,'年度+月度'!E:F,2,FALSE)","v":"MA8TJDUB8"},"福州诚丰制衣有限公司","晋安区","提升规模"]
[24,{"$f":"VLOOKUP(C27,'年度+月度'!E:F,2,FALSE)","v":"MA8UNEYY7"},"中科城投（福建）发展有限公司","晋安区","提升规模"]
[25,{"$f":"VLOOKUP(C28,'年度+月度'!E:F,2,FALSE)","v":"MA2Y0NHQ5"},"福州鑫阳光服装有限公司","晋安区","提升规模"]
[26,{"$f":"VLOOKUP(C29,'年度+月度'!E:F,2,FALSE)","v":"MA347X5P0"},"福建宏升兄弟食品有限公司","马尾区","提升规模"]
[27,{"$f":"VLOOKUP(C30,'年度+月度'!E:F,2,FALSE)","v":"MA8UKBD6X"},"福建多加新材料有限公司","马尾区","提升规模"]
[28,{"$f":"VLOOKUP(C31,'年度+月度'!E:F,2,FALSE)","v":"MA31JTTHX"},"福建瑶光智能科技有限公司","马尾区","提升规模"]
[29,{"$f":"VLOOKUP(C32,'年度+月度'!E:F,2,FALSE)","v":"058447788"},"福建省鑫旭达不锈钢制品有限公司","马尾区","提升规模"]
[30,{"$f":"VLOOKUP(C33,'年度+月度'!E:F,2,FALSE)","v":"MA32C0YL8"},"福建佳灵电气设备有限公司","马尾区","提升规模"]
[31,{"$f":"VLOOKUP(C34,'年度+月度'!E:F,2,FALSE)","v":"MA2YE0KQ8"},"福建海卓售电有限公司","马尾区","提升规模"]
[32,{"$f":"VLOOKUP(C35,'年度+月度'!E:F,2,FALSE)","v":"79839567X"},"福州西铁机电技术有限公司","马尾区","提升规模"]
[33,{"$f":"VLOOKUP(C36,'年度+月度'!E:F,2,FALSE)","v":"761786909"},"福州苏榕电气成套有限公司","马尾区","提升规模"]
[34,{"$f":"VLOOKUP(C37,'年度+月度'!E:F,2,FALSE)","v":"399210375"},"福建嘉渔工贸有限公司","马尾区","提升规模"]
[35,{"$f":"VLOOKUP(C38,'年度+月度'!E:F,2,FALSE)","v":"561682304"},"福州顺达金属工业有限公司","马尾区","提升规模"]
[36,{"$f":"VLOOKUP(C39,'年度+月度'!E:F,2,FALSE)","v":"MA348QDC1"},"福州需求侧电力科技有限公司","马尾区","提升规模"]
[37,{"$f":"VLOOKUP(C40,'年度+月度'!E:F,2,FALSE)","v":"MA34D4B83"},"贝乐鲜（福州）食品科技有限公司","马尾区","新建投产"]
[38,{"$f":"VLOOKUP(C41,'年度+月度'!E:F,2,FALSE)","v":"555055793"},"福建省恒裕实业有限公司","长乐区","提升规模"]
[39,{"$f":"VLOOKUP(C42,'年度+月度'!E:F,2,FALSE)","v":"MA8T4P171"},"福州市长乐区琪广通砂石有限公司","长乐区","提升规模"]
[40,{"$f":"VLOOKUP(C43,'年度+月度'!E:F,2,FALSE)","v":"587500484"},"福建鑫四海装饰材料有限公司","长乐区","提升规模"]
[41,{"$f":"VLOOKUP(C44,'年度+月度'!E:F,2,FALSE)","v":"MA33XDYL9"},"福州市长乐区宏源健康科技有限公司","长乐区","提升规模"]
[42,{"$f":"VLOOKUP(C45,'年度+月度'!E:F,2,FALSE)","v":"MA33JX3U3"},"福州光闰光学有限公司","长乐区","提升规模"]
[43,{"$f":"VLOOKUP(C46,'年度+月度'!E:F,2,FALSE)","v":"MA8ULB0B3"},"福建博那德中科新材料有限公司","长乐区","提升规模"]
[44,{"$f":"VLOOKUP(C47,'年度+月度'!E:F,2,FALSE)","v":"563358356"},"福州市长乐区鸿兴针织有限公司","长乐区","提升规模"]
[45,{"$f":"VLOOKUP(C48,'年度+月度'!E:F,2,FALSE)","v":"MA8TNEPG1"},"福建恒洲纺织科技有限公司","长乐区","提升规模"]
[46,{"$f":"VLOOKUP(C49,'年度+月度'!E:F,2,FALSE)","v":"MA8UJNFF3"},"福州市长乐区德晟纤维科技有限公司","长乐区","提升规模"]
[47,{"$f":"VLOOKUP(C50,'年度+月度'!E:F,2,FALSE)","v":"587532830"},"福建针凌机械有限公司","长乐区","提升规模"]
[48,{"$f":"VLOOKUP(C51,'年度+月度'!E:F,2,FALSE)","v":"MA345UD91"},"福建坤和纺织有限公司","长乐区","提升规模"]
[49,{"$f":"VLOOKUP(C52,'年度+月度'!E:F,2,FALSE)","v":"MA8UR2CC6"},"福建翔越材料有限公司","长乐区","提升规模"]
[50,{"$f":"VLOOKUP(C53,'年度+月度'!E:F,2,FALSE)","v":"MA31P0PD5"},"福建天宁金岛贝壳科技有限公司","长乐区","提升规模"]
[51,{"$f":"VLOOKUP(C54,'年度+月度'!E:F,2,FALSE)","v":"MA31ERDG7"},"福州晶创玻璃有限公司","长乐区","提升规模"]
[52,{"$f":"VLOOKUP(C55,'年度+月度'!E:F,2,FALSE)","v":"MA3430LD2"},"福建省中筑建安钢结构有限公司","长乐区","提升规模",1]
[53,{"$f":"VLOOKUP(C56,'年度+月度'!E:F,2,FALSE)","v":"MABXG0JEX"},"福州合和新材料有限公司","长乐区","提升规模"]
[54,{"$f":"VLOOKUP(C57,'年度+月度'!E:F,2,FALSE)","v":"MA32G4440"},"福州市滨海水务发展有限公司","长乐区","提升规模"]
[55,{"$f":"VLOOKUP(C58,'年度+月度'!E:F,2,FALSE)","v":"MA8T7FR92"},"福建长昇科技有限公司","长乐区","提升规模"]
[56,{"$f":"VLOOKUP(C59,'年度+月度'!E:F,2,FALSE)","v":"MA8T5CG0X"},"欧睿宇邦（福建）智能科技有限公司","长乐区","提升规模"]
[57,{"$f":"VLOOKUP(C60,'年度+月度'!E:F,2,FALSE)","v":"MA8URTA09"},"福建天翔舒沃体育用品有限公司","长乐区","提升规模"]
[58,{"$f":"VLOOKUP(C61,'年度+月度'!E:F,2,FALSE)","v":"337512263"},"华能（福州长乐）光伏发电有限责任公司","长乐区","提升规模"]
[59,{"$f":"VLOOKUP(C62,'年度+月度'!E:F,2,FALSE)","v":"MABP18C62"},"福州市长乐区山海乐裁纺织有限公司","长乐区","提升规模"]
[60,{"$f":"VLOOKUP(C63,'年度+月度'!E:F,2,FALSE)","v":"MABUQEQT7"},"汇纳肉业（福州）有限公司","长乐区","提升规模"]
[61,{"$f":"VLOOKUP(C64,'年度+月度'!E:F,2,FALSE)","v":"MABNYRQW4"},"福建锟泰钢管制造有限公司","长乐区","提升规模"]
[62,{"$f":"VLOOKUP(C65,'年度+月度'!E:F,2,FALSE)","v":"MA8ULTU70"},"福建嘉德纺织有限公司","长乐区","提升规模"]
[63,{"$f":"VLOOKUP(C66,'年度+月度'!E:F,2,FALSE)","v":"MA32E0UK5"},"福州锦华针织有限公司","长乐区","提升规模"]
[64,{"$f":"VLOOKUP(C67,'年度+月度'!E:F,2,FALSE)","v":"MA3413XH9"},"福建福州鼎锦城建材有限公司","长乐区","提升规模"]
[65,{"$f":"VLOOKUP(C68,'年度+月度'!E:F,2,FALSE)","v":"064149103"},"福建富平实业有限公司","长乐区","提升规模"]
[66,{"$f":"VLOOKUP(C69,'年度+月度'!E:F,2,FALSE)","v":"782182733"},"福州市长乐区古源茶叶有限公司","长乐区","提升规模"]
[67,{"$f":"VLOOKUP(C70,'年度+月度'!E:F,2,FALSE)","v":"753149352"},"福建福创建筑安全技术开发有限公司","长乐区","提升规模"]
[68,{"$f":"VLOOKUP(C71,'年度+月度'!E:F,2,FALSE)","v":"574719022"},"福建碧全科技有限公司","长乐区","提升规模"]
[69,{"$f":"VLOOKUP(C72,'年度+月度'!E:F,2,FALSE)","v":"MA8TDGRA6"},"福建埃克斯动力设备有限公司","长乐区","提升规模"]
[70,{"$f":"VLOOKUP(C73,'年度+月度'!E:F,2,FALSE)","v":"MA35CEQL8"},"福州恒美光电材料有限公司","长乐区","提升规模"]
[71,{"$f":"VLOOKUP(C74,'年度+月度'!E:F,2,FALSE)","v":"337472476"},"福建汇邦包装有限公司","长乐区","提升规模"]
[72,{"$f":"VLOOKUP(C75,'年度+月度'!E:F,2,FALSE)","v":"MA31QQ209"},"福建省立华智纺科技有限公司","长乐区","提升规模"]
[73,{"$f":"VLOOKUP(C76,'年度+月度'!E:F,2,FALSE)","v":"MAC2J08Q8"},"福州恒易家居有限公司","长乐区","新建投产"]
[74,{"$f":"VLOOKUP(C77,'年度+月度'!E:F,2,FALSE)","v":"MAC0976M5"},"福建鑫丰联实业有限公司","长乐区","新建投产"]
[75,{"$f":"VLOOKUP(C78,'年度+月度'!E:F,2,FALSE)","v":"MA321XNT3"},"福建富轩科技有限公司","福清市","提升规模"]
[76,{"$f":"VLOOKUP(C79,'年度+月度'!E:F,2,FALSE)","v":"MA31M6UF3"},"福建川海水产有限公司","福清市","提升规模"]
[77,{"$f":"VLOOKUP(C80,'年度+月度'!E:F,2,FALSE)","v":"098134065"},"福清市旭瑞光电科技有限公司","福清市","提升规模"]
[78,{"$f":"VLOOKUP(C81,'年度+月度'!E:F,2,FALSE)","v":"MA3362MF6"},"福州鑫丰玻璃有限公司","福清市","提升规模"]
[79,{"$f":"VLOOKUP(C82,'年度+月度'!E:F,2,FALSE)","v":"MA35CH842"},"福清丰通鞋业有限公司","福清市","提升规模"]
[80,{"$f":"VLOOKUP(C83,'年度+月度'!E:F,2,FALSE)","v":"MA3503G90"},"邹氏家居（福州）有限公司","福清市","提升规模"]
[81,{"$f":"VLOOKUP(C84,'年度+月度'!E:F,2,FALSE)","v":"MA345R9W6"},"福清鑫利金属制品有限公司","福清市","提升规模"]
[82,{"$f":"VLOOKUP(C85,'年度+月度'!E:F,2,FALSE)","v":"563386875"},"福建德隆实业有限公司","福清市","提升规模"]
[83,{"$f":"VLOOKUP(C86,'年度+月度'!E:F,2,FALSE)","v":"MA8UMNUG3"},"福清市飞林食品有限公司","福清市","提升规模"]
[84,{"$f":"VLOOKUP(C87,'年度+月度'!E:F,2,FALSE)","v":"MA31G26D0"},"泰士康医疗科技（福州）有限公司","福清市","提升规模"]
[85,{"$f":"VLOOKUP(C88,'年度+月度'!E:F,2,FALSE)","v":"MA8UB61K5"},"福清三强鞋业有限公司","福清市","提升规模"]
[86,{"$f":"VLOOKUP(C89,'年度+月度'!E:F,2,FALSE)","v":"MA8TLPKJ3"},"福建铠盾材料科技有限公司","福清市","提升规模"]
[87,{"$f":"VLOOKUP(C90,'年度+月度'!E:F,2,FALSE)","v":"MA8UKEJ31"},"福清市冠翔再生资源有限公司","福清市","提升规模"]
[88,{"$f":"VLOOKUP(C91,'年度+月度'!E:F,2,FALSE)","v":"MA329PQ90"},"煜烁食品（福清）有限公司","福清市","提升规模"]
[89,{"$f":"VLOOKUP(C92,'年度+月度'!E:F,2,FALSE)","v":"MA32GD4X2"},"福建淼天汇食品有限公司","福清市","提升规模"]
[90,{"$f":"VLOOKUP(C93,'年度+月度'!E:F,2,FALSE)","v":"MABUF0XA8"},"福建镜祥科技有限公司","福清市","提升规模"]
[91,{"$f":"VLOOKUP(C94,'年度+月度'!E:F,2,FALSE)","v":"MA34G65P6"},"福州福融泽实业有限公司","福清市","提升规模"]
[92,{"$f":"VLOOKUP(C95,'年度+月度'!E:F,2,FALSE)","v":"MA347FRA9"},"福建省多普健水产科技有限公司","福清市","提升规模"]
[93,{"$f":"VLOOKUP(C96,'年度+月度'!E:F,2,FALSE)","v":"MAC3HFKQ5"},"万华环保科技（福建）有限公司","福清市","提升规模"]
[94,{"$f":"VLOOKUP(C97,'年度+月度'!E:F,2,FALSE)","v":"MA8UTMLQ3"},"福清交投沥青混凝土有限公司","福清市","提升规模"]
[95,{"$f":"VLOOKUP(C98,'年度+月度'!E:F,2,FALSE)","v":"MA31T0052"},"福建升辉鞋业有限公司","福清市","提升规模"]
[96,{"$f":"VLOOKUP(C99,'年度+月度'!E:F,2,FALSE)","v":"MA32GM4A9"},"福建港龙深鲜水产食品有限公司","福清市","提升规模"]
[97,{"$f":"VLOOKUP(C100,'年度+月度'!E:F,2,FALSE)","v":"154915991"},"福清市五星服装厂","福清市","提升规模"]
[98,{"$f":"VLOOKUP(C101,'年度+月度'!E:F,2,FALSE)","v":"MA31FULY9"},"福建云创食品科技有限公司","福清市","提升规模"]
[99,{"$f":"VLOOKUP(C102,'年度+月度'!E:F,2,FALSE)","v":"MA34D0M66"},"福建高湖世家鞋业有限公司","福清市","提升规模"]
[100,{"$f":"VLOOKUP(C103,'年度+月度'!E:F,2,FALSE)","v":"MA8RM5AF6"},"福建联升纺织有限公司","福清市","提升规模"]
[101,{"$f":"VLOOKUP(C104,'年度+月度'!E:F,2,FALSE)","v":"MA323RU48"},"福清市兴弘塑料制品有限公司","福清市","提升规模"]
[102,{"$f":"VLOOKUP(C105,'年度+月度'!E:F,2,FALSE)","v":"MAC91J1T8"},"福建冠航食品有限公司","福清市","提升规模"]
[103,{"$f":"VLOOKUP(C106,'年度+月度'!E:F,2,FALSE)","v":"068769617"},"福州市海昌生物科技有限公司","福清市","提升规模"]
[104,{"$f":"VLOOKUP(C107,'年度+月度'!E:F,2,FALSE)","v":"753128770"},"福清黎阳水务有限公司","福清市","提升规模"]
[105,{"$f":"VLOOKUP(C108,'年度+月度'!E:F,2,FALSE)","v":"MA2XN69R0"},"福清市弘旭塑料制品有限公司","福清市","提升规模"]
[106,{"$f":"VLOOKUP(C109,'年度+月度'!E:F,2,FALSE)","v":"696623512"},"福州市坤杰服饰科技有限公司","福清市","提升规模"]
[107,{"$f":"VLOOKUP(C110,'年度+月度'!E:F,2,FALSE)","v":"MA33UX4A6"},"福建省云鲲塑业有限公司","福清市","提升规模"]
[108,{"$f":"VLOOKUP(C111,'年度+月度'!E:F,2,FALSE)","v":"MA8RDX883"},"福清市鑫福融家居用品有限公司","福清市","提升规模"]
[109,{"$f":"VLOOKUP(C112,'年度+月度'!E:F,2,FALSE)","v":"337475589"},"福州富春紫光污水处理有限公司","福清市","提升规模"]
[110,{"$f":"VLOOKUP(C113,'年度+月度'!E:F,2,FALSE)","v":"073247880"},"福州家和兴纺织有限公司","福清市","提升规模"]
[111,{"$f":"VLOOKUP(C114,'年度+月度'!E:F,2,FALSE)","v":"MA31DR0R9"},"福清市瑞强制衣有限公司","福清市","提升规模"]
[112,{"$f":"VLOOKUP(C115,'年度+月度'!E:F,2,FALSE)","v":"MA32DH175"},"福清联辉鞋业有限公司","福清市","新建投产"]
[113,{"$f":"VLOOKUP(C116,'年度+月度'!E:F,2,FALSE)","v":"MA3563NA6"},"中粮制桶（福建）有限公司","福清市","新建投产"]
[114,{"$f":"VLOOKUP(C117,'年度+月度'!E:F,2,FALSE)","v":"MA8UW5AT8"},"福建富元高分子材料科技有限公司","福清市","新建投产"]
[115,{"$f":"VLOOKUP(C118,'年度+月度'!E:F,2,FALSE)","v":"MA8TDBX33"},"福建福盛和塑胶制品有限公司","福清市","新建投产"]
[116,{"$f":"VLOOKUP(C119,'年度+月度'!E:F,2,FALSE)","v":"MA35EKD94"},"福建思嘉新材料科技有限公司","福清市","新建投产"]
[117,{"$f":"VLOOKUP(C120,'年度+月度'!E:F,2,FALSE)","v":"MABWD5EJ5"},"福建洁电电气有限公司","福清市","新建投产"]
{"$rows_left_out":119}
{"sheet":"年度+月度","index":1,"n_rows":277,"n_cols":17,"rows_kept":277}
["期别","单位类型","所属专业","审核类型","详细名称","组织机构代码","所在地区划代码","行业代码_17","填表处理地代码","专业审批_国家_状态","名录终审_国家_状态","统计局代码","县区"]
["2023年","1","1","2","福建华电福瑞能源发展有限公司","MA33WCDD1","350102003005","4420","350102","1","1","350102000000","鼓楼区"]
["2023年","1","1","2","福建省恒裕实业有限公司","555055793","350112111206","2821","350112","1","1","350112000000","长乐区"]
["2023年","1","1","2","福州市长乐区琪广通砂石有限公司","MA8T4P171","350112104202","3032","350112","1","1","350112000000","长乐区"]
["2023年","1","1","2","福建宏升兄弟食品有限公司","MA347X5P0","350105101210","1361","350105","1","1","350105000000","马尾区"]
["2023年","1","1","2","福州市耐步鞋业有限公司","MABT1QF13","350104101203","1953","350104","1","1","350104000000","仓山区"]
["2023年","1","1","2","福建鑫四海装饰材料有限公司","587500484","350112110210","3352","350112","1","1","350112000000","长乐区"]
["2023年","1","1","2","福建富轩科技有限公司","MA321XNT3","350181116218","2662","350181","1","1","350181000000","福清市"]
["2023年","1","1","2","福州市长乐区宏源健康科技有限公司","MA33XDYL9","350112108201","2651","350112","1","1","350112000000","长乐区",{"$nulls":3},"县区"]
["2023年","1","1","2","福州汉晶电子科技有限公司","671921820","350104102206","3811","350104","1","1","350104000000","仓山区",{"$nulls":3},"鼓楼区"]
["2023年","1","1","2","福建川海水产有限公司","MA31M6UF3","350181112205","1369","350181","1","1","350181000000","福清市",{"$nulls":3},"仓山区"]
["2023年","1","1","2","福州比得福农业科技发展有限公司","310760443","350104101223","1399","350104","1","1","350104000000","仓山区",{"$nulls":3},"晋安区"]
["2023年","1","1","2","山辉（福建）生物科技发展有限公司","MA32YUU88","350121102203","2761","350121","1","1","350121000000","高新区",{"$nulls":3},"马尾区"]
["2023年","1","1","2","福州光闰光学有限公司","MA33JX3U3","350112103211","4040","350112","1","1","350112000000","长乐区",{"$nulls":3},"长乐区"]
["2023年","1","1","2","福清市旭瑞光电科技有限公司","098134065","350181006202","3481","350181","1","1","350181000000","福清市",{"$nulls":3},"福清市"]
["2023年","1","1","2","福建博那德中科新材料有限公司","MA8ULB0B3","350112111209","3024","350112","1","1","350112000000","长乐区",{"$nulls":3},"闽侯县"]
["2023年","1","1","2","福州市长乐区鸿兴针织有限公司","563358356","350112110207","1761","350112","1","1","350112000000","长乐区",{"$nulls":3},"高新区"]
["2023年","1","1","2","福建恒洲纺织科技有限公司","MA8TNEPG1","350112110207","1761","350112","1","1","350112000000","长乐区",{"$nulls":3},"连江县"]
["2023年","1","1","2","福建多加新材料有限公司","MA8UKBD6X","350105101213","2641","350105","1","1","350105000000","马尾区",{"$nulls":3},"罗源县"]
["2023年","1","1","2","福州日恒机电设备有限公司","669260269","350104102206","3484","350104","1","1","350104000000","仓山区",{"$nulls":3},"闽清县"]
["2023年","1","1","2","福州蓝科装备制造有限公司","MA8UAEF90","350121108212","3972","350121","1","1","350121000000","闽侯县",{"$nulls":3},"永泰县"]
["2023年","1","1","2","福建研宇自动化科技有限公司","MA32TEK91","350102009013","4011","350102","1","1","350102000000","鼓楼区",{"$nulls":3},"总计"]
["2023年","1","1","2","福建省福蓉源再生资源开发有限公司","MA8UJTGDX","350123101209","4210","350123","1","1","350123000000","罗源县"]
["2023年","1","1","2","福州北轩食品有限公司","587532777","350105100211","1361","350105","1","1","350105000000","马尾区"]
["2023年","1","1","2","福建新良佐自动化设备有限公司","MA8TCKR42","350123500498","3439","350123","1","1","350123000000","罗源县"]
["2023年","1","1","2","福州鑫丰玻璃有限公司","MA3362MF6","350181103225","3051","350181","1","1","350181000000","福清市"]
["2023年","1","1","2","福州亿芯微科技有限公司","MA34FYP85","350102006002","3973","350102","1","1","350102000000","鼓楼区"]
["2023年","1","1","2","闽清伟明环保能源有限公司","MA32R3TR5","350124102205","4417","350124","1","1","350124000000","闽清县"]
["2023年","1","1","2","福建省希望彩印有限公司","753118505","350121108001","2319","350121","1","1","350121000000","闽侯县"]
["2023年","1","1","2","福州长祥建材有限公司","MA8UYEQE2","350124205201","3099","350124","1","1","350124000000","闽清县"]
["2023年","1","1","2","福州华夏永昌胶粘制品有限公司","660380790","350121105205","2919","350121","1","1","350121000000","闽侯县"]
["2023年","1","1","2","福州融源达服饰有限公司","591726515","350111101216","1830","350111","1","1","350111000000","晋安区"]
["2023年","1","1","2","福州益诚服装有限公司","MA8UC1TE6","350121102002","1830","350121","1","1","350121000000","高新区"]
["2023年","1","1","2","福州瑞得森实业有限公司","MA33K3205","350122101206","2319","350122","1","1","350122000000","连江县"]
["2023年","1","1","2","福建瑶光智能科技有限公司","MA31JTTHX","350105100001","3962","350105","1","1","350105000000","马尾区"]
["2023年","1","1","2","福建省鑫旭达不锈钢制品有限公司","058447788","350105101209","3130","350105","1","1","350105000000","马尾区"]
["2023年","1","1","2","福建菲斯特锻件制品有限公司","74906513X","350122100008","3484","350122","1","1","350122000000","连江县"]
["2023年","1","1","2","福建同利食品有限公司","MA33HBUM9","350121001214","1432","350121","1","1","350121000000","闽侯县"]
["2023年","1","1","2","福建省翼比实集团有限公司","MABYFAE65","350121001204","2110","350121","1","1","350121000000","闽侯县"]
["2023年","1","1","2","福州东仕照明科技有限公司","727913775","350104103014","3872","350104","1","1","350104000000","仓山区"]
["2023年","1","1","2","福建省福大百阳化工科技有限公司","MA3216H98","350121107220","2689","350121","1","1","350121000000","高新区"]
["2023年","1","1","2","福清丰通鞋业有限公司","MA35CH842","350181118207","1953","350181","1","1","350181000000","福清市"]
["2023年","1","1","2","福州市长乐区德晟纤维科技有限公司","MA8UJNFF3","350112110208","2822","350112","1","1","350112000000","长乐区"]
["2023年","1","1","2","平潭鸿生环保科技有限公司","MA33PE819","350128108230","3021","350128","1","1","350128000000","平潭县"]
["2023年","1","1","2","福建润禾米业有限公司","MA31NPFK6","350123102217","1311","350123","1","1","350123000000","罗源县"]
["2023年","1","1","2","福建国电风力发电有限公司","MA34AJ8P8","350102100003","4415","350102","1","1","350102000000","鼓楼区"]
["2023年","1","1","2","福建胜和食品有限公司","MA8URNUW1","350122103208","1523","350122","1","1","350122000000","连江县"]
["2023年","1","1","2","福建针凌机械有限公司","587532830","350112114215","3551","350112","1","1","350112000000","长乐区"]
["2023年","1","1","2","闽侯县兴源水力发电有限公司","743830662","350121204204","4413","350121","1","1","350121000000","闽侯县"]
["2023年","1","1","2","福建坤和纺织有限公司","MA345UD91","350112111209","1761","350112","1","1","350112000000","长乐区"]
["2023年","1","1","2","福建宝太不锈钢有限公司","MA8RE9DC8","350123500498","3032","350123","1","1","350123000000","罗源县"]
["2023年","1","1","2","福建创盈实业有限公司","MA33TUTG0","350121101205","3351","350121","1","1","350121000000","闽侯县"]
["2023年","1","1","2","福州玉龙纳米科技有限公司","591748546","350121102218","2661","350121","1","1","350121000000","高新区"]
["2023年","1","1","2","福建佳灵电气设备有限公司","MA32C0YL8","350105101213","3823","350105","1","1","350105000000","马尾区"]
["2023年","1","1","2","福州德扬电子科技有限公司","MA32BFD75","350121001001","2929","350121","1","1","350121000000","闽侯县"]
["2023年","1","1","2","福州盛扬包装用品有限公司","766193459","350121104212","2923","350121","1","1","350121000000","闽侯县"]
["2023年","1","1","2","福建省聚兴凯平船业有限公司","553226974","350122113206","4342","350122","1","1","350122000000","连江县"]
["2023年","1","1","2","邹氏家居（福州）有限公司","MA3503G90","350181005204","2110","350181","1","1","350181000000","福清市"]
["2023年","1","1","2","福建致合金属制造有限公司","MA32W8LE9","350122202202","2432","350122","1","1","350122000000","连江县"]
["2023年","1","1","2","福州凌扬机电技术有限公司","MA32TE2B3","350121102218","3670","350121","1","1","350121000000","高新区"]
["2023年","1","1","2","福清鑫利金属制品有限公司","MA345R9W6","350181006006","3329","350181","1","1","350181000000","福清市"]
["2023年","1","1","2","环德（福建）环保科技有限公司","789019277","350121108004","3591","350121","1","1","350121000000","闽侯县"]
["2023年","1","1","2","福建翔越材料有限公司","MA8UR2CC6","350112108201","1711","350112","1","1","350112000000","长乐区"]
["2023年","1","1","2","福州亿达食品有限公司","749088083","350122101202","1369","350122","1","1","350122000000","连江县"]
["2023年","1","1","2","福建德隆实业有限公司","563386875","350181116218","1953","350181","1","1","350181000000","福清市"]
["2023年","1","1","2","福建天宁金岛贝壳科技有限公司","MA31P0PD5","350112002204","2681","350112","1","1","350112000000","长乐区"]
["2023年","1","1","2","福州睿能控制技术有限公司","MA31MYTR1","350121102203","3919","350121","1","1","350121000000","高新区"]
["2023年","1","1","2","福清市飞林食品有限公司","MA8UMNUG3","350181104216","1432","350181","1","1","350181000000","福清市"]
["2023年","1","1","2","泰士康医疗科技（福州）有限公司","MA31G26D0","350181116218","2770","350181","1","1","350181000000","福清市"]
["2023年","1","1","2","福建华扬新材料科技有限公司","MA321EY20","350123101209","4090","350123","1","1","350123000000","罗源县"]
["2023年","1","1","2","福建聚福木业有限公司","689359346","350122109212","2439","350122","1","1","350122000000","连江县"]
["2023年","1","1","2","福州金华彩钢夹芯板有限公司","062270727","350121104205","3034","350121","1","1","350121000000","闽侯县"]
["2023年","1","1","2","永畅通（福建）建材有限公司","MA34E44B9","350124102205","3021","350124","1","1","350124000000","闽清县"]
["2023年","1","1","2","福清三强鞋业有限公司","MA8UB61K5","350181118210","1953","350181","1","1","350181000000","福清市"]
["2023年","1","1","2","福建铠盾材料科技有限公司","MA8TLPKJ3","350181007011","3042","350181","1","1","350181000000","福清市"]
["2023年","1","1","2","福清市冠翔再生资源有限公司","MA8UKEJ31","350181116215","4220","350181","1","1","350181000000","福清市"]
["2023年","1","1","2","福建华青电气有限公司","MA31L75D5","350121102215","3823","350121","1","1","350121000000","高新区"]
["2023年","1","1","2","福建宏博瑞业集团有限公司","MA353JWT6","350121107220","4090","350121","1","1","350121000000","高新区"]
["2023年","1","1","2","福建智可荣实业有限公司","MAC4J96M9","350121001204","2110","350121","1","1","350121000000","闽侯县"]
["2023年","1","1","2","福州新榕机械发展有限公司","611310841","350121105213","3332","350121","1","1","350121000000","闽侯县"]
["2023年","1","1","2","福州富林居新材料科技有限公司","MA2YN82CX","350121200202","2110","350121","1","1","350121000000","闽侯县"]
["2023年","1","1","2","福州晶创玻璃有限公司","MA31ERDG7","350112106207","3042","350112","1","1","350112000000","长乐区"]
["2023年","1","1","2","福州冠茗茶业有限公司","MA8RMYC48","350121104205","1530","350121","1","1","350121000000","闽侯县"]
["2023年","1","1","2","煜烁食品（福清）有限公司","MA329PQ90","350181104217","1432","350181","1","1","350181000000","福清市"]
["2023年","1","1","2","福建鑫家鸿消防科技有限公司","MA32906NX","350121104214","3312","350121","1","1","350121000000","闽侯县"]
["2023年","1","1","2","福建佳丽旺食品有限责任公司","MA8TFWY54","350121001214","1411","350121","1","1","350121000000","闽侯县"]
["2023年","1","1","2","连江县鑫辉彩印厂（普通合伙）","569281863","350122101207","2320","350122","1","1","350122000000","连江县"]
["2023年","1","1","2","福建淼天汇食品有限公司","MA32GD4X2","350181104217","1361","350181","1","1","350181000000","福清市"]
["2023年","1","1","2","福建省中筑建安钢结构有限公司","MA3430LD2","350112110207","3311","350112","1","1","350112000000","长乐区"]
["2023年","1","1","2","福建镜祥科技有限公司","MABUF0XA8","350181008208","3311","350181","1","1","350181000000","福清市"]
["2023年","1","1","2","福州福融泽实业有限公司","MA34G65P6","350181113211","3099","350181","1","1","350181000000","福清市"]
["2023年","1","1","2","福建海卓售电有限公司","MA2YE0KQ8","350105001004","4420","350105","1","1","350105000000","马尾区"]
["2023年","1","1","2","福建京华电气设备有限公司","689364444","350122103002","3823","350122","1","1","350122000000","连江县"]
["2023年","1","1","2","福建鑫宏建建筑工程有限公司","MA332KL8X","350121108002","3099","350121","1","1","350121000000","闽侯县"]
["2023年","1","1","2","福建顺涛实业有限公司","MA327R5X8","350112105217","2821","350112","1","1","350112000000","长乐区"]
["2023年","1","1","2","福建华夏蓝新材料科技有限公司","337615182","350121001214","2641","350121","1","1","350121000000","闽侯县"]
["2023年","1","1","2","福建云汉汽车科技有限公司","MA8TMWR82","350121105213","3670","350121","1","1","350121000000","闽侯县"]
["2023年","1","1","2","福建省多普健水产科技有限公司","MA347FRA9","350181104217","1329","350181","1","1","350181000000","福清市"]
["2023年","1","1","2","万华环保科技（福建）有限公司","MAC3HFKQ5","350181116215","4220","350181","1","1","350181000000","福清市"]
["2023年","1","1","2","福州开发区安然燃气有限公司","775385890","350105001002","4511","350105","1","1","350105000000","马尾区"]
["2023年","1","1","2","福州奕扬机械有限公司","MA32EKC52","350121104202","3670","350121","1","1","350121000000","闽侯县"]
["2023年","1","1","2","福州东坤饲料有限公司","772912480","350121104202","1329","350121","1","1","350121000000","闽侯县"]
["2023年","1","1","2","福清交投沥青混凝土有限公司","MA8UTMLQ3","350181103223","3099","350181","1","1","350181000000","福清市"]
["2023年","1","1","2","福建中晟食品有限公司","MA31GY96X","350121104214","1353","350121","1","1","350121000000","闽侯县"]
["2023年","1","1","2","福建升辉鞋业有限公司","MA31T0052","350181113208","1953","350181","1","1","350181000000","福清市"]
["2023年","1","1","2","福建嘉瑶食品有限公司","MA340D6U5","350121104201","1411","350121","1","1","350121000000","闽侯县"]
["2023年","1","1","2","福建茂恒汽车配件有限公司","MA2Y545X1","350121104205","3670","350121","1","1","350121000000","闽侯县"]
["2023年","1","1","2","福建省闽江沙石实业有限公司","628598968","350124100004","1019","350124","1","1","350124000000","闽清县"]
["2023年","1","1","2","福建天赐农牧开发有限公司","052310756","350121108208","1329","350121","1","1","350121000000","闽侯县"]
["2023年","1","1","2","伯特瑞（福建）生物科技有限公司","MA32FRN49","350121102203","1399","350121","1","1","350121000000","高新区"]
["2023年","1","1","2","福州合和新材料有限公司","MABXG0JEX","350112110202","2829","350112","1","1","350112000000","长乐区"]
["2023年","1","1","2","闽侯县三溪口自来水有限公司","565384013","350121104213","4610","350121","1","1","350121000000","闽侯县"]
["2023年","1","1","2","福建洛西琴家具有限公司","MACA54L85","350121106214","2110","350121","1","1","350121000000","闽侯县"]
["2023年","1","1","2","福建省连江县宏晟矿业有限公司","MA8TMG4E1","350122114002","1019","350122","1","1","350122000000","连江县"]
["2023年","1","1","2","福州西铁机电技术有限公司","79839567X","350105100212","4011","350105","1","1","350105000000","马尾区"]
["2023年","1","1","2","欧事达家居（福州）有限公司","MA8REL165","350122105205","2439","350122","1","1","350122000000","连江县"]
["2023年","1","1","2","福建大众健康生物科技有限公司","056116002","350122111203","1361","350122","1","1","350122000000","连江县"]
["2023年","1","1","2","福建省通途材料工程有限公司","685085413","350121101205","3311","350121","1","1","350121000000","闽侯县"]
["2023年","1","1","2","福州市滨海水务发展有限公司","MA32G4440","350112005002","4610","350112","1","1","350112000000","长乐区"]
["2023年","1","1","2","福建八面将食品科技有限公司","MA8UDJ319","350121001214","1469","350121","1","1","350121000000","闽侯县"]
{"$rows_left_out":157}